##TITLE= N-ethylaniline
##JCAMP-DX= 5.01 $$ Imported from UXNMR.
##DATA TYPE= NMR SPECTRUM
##DATA CLASS= XYDATA
##ORIGIN= Department of Chemistry, UWI, Mona, JAMAICA
##OWNER= public domain
##LONGDATE= 2002/07/30 00:07:28
##SOLVENT NAME= CHLOROFORM-D
##$.SHIFT REFERENCE= INTERNAL,  ,1, -4.1655
##.OBSERVE FREQUENCY= 200.131
##SPECTROMETER/DATA SYSTEM= Bruker Avance 200 MHz
##.ACQUISITION MODE= SIMULTANEOUS
##LONGDATE= 2002/07/30 00:07:28
##.ACQUISITION TIME= 1.979
##.ZERO FILL= 8192
##.OBSERVE NUCLEUS= ^1H
##.OBSERVE FREQUENCY= 200.131
##XUNITS= HZ
##YUNITS= ARBITRARY UNITS
##XFACTOR= 2.10164736E-3
##YFACTOR= 5.85235706E-3
##FIRSTX= -94.73702132
##FIRSTY= 0.36552102
##LASTX= 2006.9103343
##NPOINTS= 8319
##XYDATA= (X++(Y..Y))
-45078 62 0 -62 -344 -375 -437 -344 -312 -312 -312 -281 -344 -219 -219 -219 -125 -250 -156 -187 -250 -312 -312 -250 -156 -281 -187 -219 -125 -62 -94 -219 -250
-41246 -281 -281 -281 -344 -312 -219 -187 -187 -250 -187 -250 -219 -219 -250 -187 -281 -219 -250 -219 -281 -250 -219 -281 -312 -281 -281 -344 -375 -187 -125 -219 -281 -219
-37247 -281 -281 -94 -281 -344 -219 -281 -219 -219 -219 -219 -219 -312 -219 -312 -125 -281 -187 -125 -344 -219 -281 -250 -312 -219 -281 -156 -250 -219
-33773 -281 -219 -187 -312 -219 -219 -156 -281 -250 -312 -156 -312 -344 -250 -156 -281 -250 -187 -344 -125 -250 -219 -219 -219 -344 -312 -312 -219
-30420 -312 -219 -219 -219 -187 -156 -281 -156 -281 -219 -219 -406 -187 -312 -219 -187 -219 -281 -250 -219 -187 -156 -219 -312 -187 -219 -250 -250 -125
-26949 -187 -281 -187 -219 -250 -187 -250 -344 -250 -250 -125 -156 -187 -250 -281 -250 -250 -281 -281 -281 -187 -281 -187 -187 -281 -156 -219 -219 -312 -250 -250 -250 -219 -250
-22829 -250 -250 -312 -344 -312 -219 -125 -219 -187 -250 -281 -187 -219 -281 -281 -219 -281 -250 -187 -187 -187 -219 -281 -250 -312 -94 -219 -312 -375 -250 -187
-19118 -344 -187 -250 -187 -250 -281 -156 -187 -219 -156 -219 -281 -281 -250 -219 -156 -250 -125 -312 -219 -219 -156 -250 -187 -187 -281 -281 -156 -125 -250
-15504 -250 -281 -312 -250 -187 -250 -250 -187 -187 -250 -187 -250 -156 -156 -281 -281 -156 -250 -125 -187 -187 -281 -250 -219 -187 -281 -156 -281 -187 -250 -219
-11770 -187 -250 -312 -250 -250 -125 -219 -156 -250 -156 -187 -250 -156 -187 -156 -281 -250 -187 -250 -312 -219 -219 -250 -312 -219 -219 -219 -219 -62 -250 -187
-8059 -281 -187 -187 -312 -219 -94 -156 -250 -250 -250 -187 -312 -219 -250 -156 -312 -156 -125 -250 -219 -250 -344 -187 -250 -281 -250 -281 -250 -312
-4588 -250 -281 -312 -250 -219 -281 -219 -250 -219 -344 -219 -250 -281 -281 -250 -187 -187 -219 -187 -250 -187 -250 -281 -219 -156 -156 -281 -312 -281 -281 -94
-857 -250 -156 -344 -281 -62 -156 -219 -156 -250 -281 -250 -281 -156 -125 -187 -281 -156 -219 -281 -187 -187 -187 -312 -219 -187 -250 -219 -250 -250
2662 -281 -312 -312 -219 -125 -219 -219 -187 -250 -312 -281 -250 -250 -156 -219 -187 -219 -187 -187 -250 -187 -281 -250 -281 -312 -344 -312 -250 -281 -250 -125 -250
6494 -281 -156 -344 -187 -281 -187 -250 -312 -250 -187 -219 -250 -219 -156 -250 -156 -187 -250 -31 -250 -250 -312 -125 -94 -187 -250 -312 -219
9844 -281 -219 -156 -344 -219 -219 -344 -281 -281 -250 -219 -219 -250 -187 -250 -219 -187 -219 -344 -250 -281 -187 -219 -187 -219 -281 -281 -250 -219 -219 -219
13603 -187 -281 -219 -187 -281 -344 -156 -312 -312 -187 -156 -125 -187 -281 -156 -344 -250 -281 -156 -250 -187 -31 -312 -250 -219 -187 -187
16834 -312 -312 -250 -187 -281 -250 -281 -281 -219 -281 -219 -250 -125 -156 -250 -156 -250 -187 -219 -250 -156 -250 -187 -219 -219 -406 -312 -219 -156 -250 -250
20568 -219 -250 -219 -281 -219 -219 -281 -312 -312 -250 -250 -187 -219 -250 -250 -250 -156 -219 -250 -281 -156 -187 -250 -219 -281 -250 -187 -281 -187 -156 -219 -125 -250
24519 -250 -312 -219 -250 -281 -219 -219 -250 -219 -219 -281 -219 -187 -219 -187 -312 -250 -344 -250 -344 -94 -219 -250 -281 -250 -187 -187 -250 -219 -219 -281
28253 -312 -250 -187 -219 -219 -187 -250 -344 -219 -94 -281 -250 -187 -281 -219 -125 -281 -281 -125 -312 -156 -156 -187 -187 -156 -156 -281 -156 -125
31724 -156 -250 -94 -125 -281 -250 -281 -344 -281 -281 -219 -219 -281 -187 -312 -281 -219 -344 -156 -344 -312 -187 -281 -375 -281 -156 -250 -250
35090 -219 -281 -250 -250 -187 -156 -125 -125 -219 -125 -219 -125 -125 -187 -156 -187 -312 -156 -125 -281 -344 -250 -187 -187 -187 -219 -187 -281 -250 -219 -250 -187
38944 -281 -250 -156 -187 -312 -219 -312 -219 -281 -219 -344 -250 -312 -156 -281 -250 -312 -312 -312 -219 -250 -250 -375 -156 -281 -187 -312 -125
42298 -219 -219 -219 -281 -219 -219 -187 -219 -187 -219 -187 -281 -125 -94 -219 -250 -156 -187 -156 -187 -187 -312 -219 -219 -281 -312 -219 -281 -375 -281 -312 -281
46177 -312 -281 -219 -281 -250 -156 -219 -250 -281 -281 -219 -312 -250 -312 -219 -219 -312 -250 -187 -187 -156 -125 -156 -250 -156 -125 -219 -344 -281 -250 -344 -250
50018 -219 -250 -187 -312 -187 -312 -219 -219 -156 -281 -219 -219 -187 -250 -250 -281 -187 -375 -281 -250 -187 -219 -250 -219 -125 -312 -281 -156 -219
53504 -219 -125 -219 -219 -250 -187 -156 -187 -125 -156 -219 -156 -219 -94 -219 -156 -187 -219 -187 -250 -250 -219 -219 -250 -94 -125 -250 -281 -250 -250
57093 -281 -250 -312 -250 -187 -187 -219 -219 -281 -156 -250 -281 -250 -344 -281 -94 -219 -312 -250 -250 -187 -187 -281 -344 -250 -156 -156 -281 -219 -219 -219 -187
60925 -312 -281 -219 -156 -187 -94 -62 -187 -219 -94 -187 -250 -219 -250 -94 -219 -125 -219 -219 -281 -125 -281 -281 -312 -219 -312 -187 -250
64298 -187 -187 -187 -219 -219 -219 -125 -94 -219 -312 -62 -281 -156 -250 -219 -187 -187 -156 -250 -219 -219 -312 -187 -250 -187 -250 -250 -344 -219 -250 -156
68057 -219 -219 -281 -156 -219 -250 -187 -156 -187 -187 -187 -281 -187 -281 -250 -250 -281 -281 -187 -281 -125 -156 -219 -156 -281 -281 -156 -187 -312 -312 -312 -187
71888 -250 -250 -250 -344 -250 -219 -125 -250 -219 -219 -156 -219 -219 -219 -156 -125 -187 -187 -156 -187 -94 -219 -156 -219 -187 -187 -344 -156 -281 -250 -250 -250
75743 -156 -312 -94 -250 -187 -250 -187 -219 -187 -312 -156 -312 -219 -187 -156 -250 -187 -156 -187 -187 -156 -187 -219 -125 0 -125 -187
78973 -156 -281 -62 -187 -281 -156 -219 -219 -375 -125 -187 -281 -250 -250 -156 -94 -250 -156 -156 -281 -219 -219 -219 -219 -125 -281 -281 -187 -219 -156
82562 -219 -219 -125 -187 -250 -281 -250 -156 -219 -125 -250 -187 -250 -156 -187 -156 -125 -156 -187 -94 -219 -156 -187 -281 -187 -250 -250 -156 -187 -219 -219
86298 -281 -219 -312 -250 -344 -312 -344 -312 -344 -219 -250 -156 -250 -281 -250 -94 -187 -125 -94 -250 -250 -281 -312 -219 -281 -312 -312 -312 -281 -187 -281
90035 -219 -406 -312 -281 -281 -250 -281 -187 -250 -344 -281 -219 -344 -250 -250 -375 -219 -187 -281 -344 -344 -250 -156 -406 -312 -500 -219 -281 -250
93536 -500 -312 -468 -406 -312 -344 -281 -344 -344 -312 -312 -281 -281 -281 -375 -250 -344 -281 -219 -344 -281 -281 -375 -406 -468 -468 -344 -344 -531 -312 -406
97255 -437 -406 -468 -437 -375 -312 -312 -187 -94 -31 156 437 531 531 812 874 937 906 1031 1124 1374 1499 1624 1936 2155 2217 2217
100490 1967 1405 874 437 312 62 31 0 31 219 593 749 1155 1343 1593 1905 2030 2155 2405 2467 2779 3123
103132 3498 3935 4341 4591 5184 5215 4778 3466 2498 1499 874 437 281 187 156 187 312 375 625 718 999 968 1124
105914 1155 1187 1343 1499 1593 1811 2092 2498 2530 2779 2654 2561 1967 1499 906 593 125 31 31 31 -125 -94 -62 -94 -94
108902 -31 0 -94 -62 31 -94 -62 -187 -31 31 125 31 156 219 281 156 156 31 0 0 -219 -62 -94 -156 -62 -94 -156 -156
112268 -219 -219 -219 -156 -62 -125 -94 -156 -156 -31 31 156 62 219 281 375 250 219 250 250 250 437 375 344 156 344 250 125 187
115739 219 31 219 62 250 0 94 0 125 62 250 125 312 250 250 187 406 281 406 437 593 593 843 874 1155
118759 1062 1312 1187 1124 1093 1218 999 1031 1031 1218 1124 1280 1249 1437 1343 1405 1031 1343 1374 1624 1593 1593 1530 1530 1374 1312
121904 1405 1749 1842 2248 2155 2186 2186 2186 2030 2061 2030 2217 2436 2467 2530 2748 2654 2811 2530 3092 3404 3872 3904 3935 3841 3591
125005 3185 2935 2686 2998 3185 3310 3529 3654 3685 3904 3935 4216 4559 4934 5340 5652 6027 6464 7058 7432 8213 9212
127677 10680 11867 13928 16645 24827 41909 66642 92655 117388 141559 163762 179970 195897 213103
129367 225751 236525 255168 280120 311224 347542 390731 419680 455780 487384 476360 401099 299669
130890 211854 144026 92749 63269 53619 58616 84098 130785 184248 235245 283555 331397 366717 396165
132605 430766 461089 478015 510555 556805 618793 685591 776216 843889 902942 984136 999313 883767
134178 665480 466804 309194 189058 105771 72263 59865 63987 80101 104303 128068 151896 174942
135723 194429 208763 225470 240897 250422 264474 286678 316845 351009 395353 434483 464524 505434
137271 521423 475767 371089 264006 176691 109269 60708 36537 25639 19893 16145 13584 11461
138838 9931 8682 7557 6589 5465 4434 3560 3123 2779 2748 2779 2998 2998 3154 3060 3123 2873 2811 2436 2186 1905 2092
141480 1936 2311 2124 2248 2030 2030 1842 1874 1530 1437 1062 1062 625 781 406 625 437 843 656 906 625 749 375
144265 625 219 312 156 406 344 468 281 437 187 250 94 125 -94 -125 -187 -156 -219 -219 -281 -250 -468 -156 -375 -187
147258 -281 -219 -312 -250 -312 -219 -312 -250 -312 -156 -281 -156 -250 -62 -219 -125 -94 -125 0 -31 31 156 156 125 125 156 94 156
150631 -31 31 -156 31 -31 94 94 -31 31 62 31 31 125 31 125 125 281 375 437 437 500 344 531 562 593 468 500 562 468
154087 562 375 437 312 281 312 250 156 125 187 156 125 94 94 94 219 156 187 219 250 125 281 187 219 156 219 250 281 281
157606 281 281 406 344 531 437 656 749 937 999 1093 999 1249 1187 1312 1343 1530 1624 1905 1999 2248 2405 2498 2373 2092 1499
160701 968 562 437 125 125 187 406 625 937 1249 1561 1811 1936 2061 2280 2405 2561 2623 2935 3154 3623 3935 4466
163488 4716 5246 5403 4809 3747 2748 1780 1124 718 406 312 375 437 593 593 781 874 1031 1093 1249 1280 1468 1468
166273 1499 1686 1842 2061 2405 2373 2717 2873 2623 2092 1437 999 593 344 219 187 0 -94 94 31 -94 -62
168908 -31 0 0 125 62 94 31 156 -31 0 -94 -31 -125 31 -62 31 -219 0 -94 -62 -156 -187 -156 -156 -219 -187 -187 -94 -156 -62
172496 -94 94 -125 125 -62 -62 -94 -156 -125 31 -125 -187 -62 0 -156 -94 -187 -94 -94 -156 -31 -125 -62 -62 -94 -94 -94 -125 -156
176012 -187 -219 -187 -156 -156 -156 -31 -94 -62 -219 -94 -94 -125 -62 -125 -156 -31 -156 -156 -125 -125 -187 -156 -156 -187 -156 -156 -125 -250 -125 -187
179721 -94 -94 -94 -156 -94 -250 -250 -219 -125 -156 -250 -281 -250 -281 -187 -250 -344 -344 -281 -219 -219 -344 -156 -375 -281 -250 -219 -156 -156 -219 -250 -187
183578 -187 -281 -312 -156 -219 -156 -125 -250 -250 -250 -187 -281 -281 -281 -187 -406 -281 -219 -187 -312 -312 -219 -250 -312 -406 -312 -250 -219 -281 -219 -312
187292 -281 -219 -250 -281 -281 -250 -250 -219 -187 -250 -219 -250 -219 -219 -250 -250 -187 -125 -125 -62 -187 -156 -94 -187 -156 -156 -187 -125 -125 -125 -156 -187 -156 -156
191361 -219 -125 -187 -94 -125 0 -187 -31 0 -156 -94 31 -31 -31 -31 -94 62 -62 -125 -187 -187 -187 -187 -187 -250 -250 -281 -219 -187 -187 -125
195120 -187 -312 -250 -125 -187 -187 -312 -219 -156 -344 -125 -375 -312 -250 -250 -250 -156 -187 -187 -31 -219 -156 -156 -125 -187 -156 -125 -156 -187
198614 -62 -219 -125 -125 -125 -250 -219 -219 -219 -125 -94 -187 -187 -250 -219 -312 -31 -250 -219 -219 -125 -125 -125 -156 -156 -156 -187 -94 -219 -219 -156 -94 -156 -156
202683 -125 -125 -250 -219 -187 -219 -187 -94 -187 -219 -281 -187 -156 -187 -156 -156 -125 -219 -187 -187 -156 -312 -187 -219 -156 -250 -125 -187 -187 -187 -187
206417 -187 -219 -62 -187 -219 -156 -156 -219 -219 -156 -187 -250 -156 -156 -219 -219 -125 -219 -125 -156 -94 -62 -219 -156 -156 -125 -156 -62 -219 -187 -250
210151 -219 -187 -219 -125 -156 -94 -125 -156 -156 -156 -62 -312 -250 -250 -250 -187 -219 -187 -281 -187 -250 -250 -312 -125 -156 -187 -312 -250 -219 -125 -250 -187
213957 -219 -94 -156 -219 -187 -156 -94 -219 -219 -250 -156 -250 -187 -125 -187 -281 -250 -94 -156 -187 -125 31 0 156 94 125 281 344
217361 437 531 593 625 749 874 968 1155 718 531 156 62 -62 -94 -31 -187 -156 -281 -94 -156 -125 -94 -250 -219 -156
220348 -125 -250 -125 -187 -156 -187 -94 -187 -156 -125 -187 -187 -219 -125 -156 -281 -156 -187 -187 -219 -94 -219 -187 -94 -156 -219 -219 -125 -125
223839 -250 -156 -156 -281 -187 -62 -156 -250 -62 -219 -125 -125 -187 -156 -156 -219 -187 -281 -94 -156 -156 -31 -125 -125 -187 -187 -125 -156 -156 -94 -125
227573 -125 -219 -219 -94 -125 -125 -250 -62 -62 -156 -187 -156 -250 -125 -94 -125 -250 -125 -125 -125 -125 -156 -312 -219 -94 -156 -219 -94 -187
231069 -125 -125 -125 -94 -187 -62 -125 -187 -125 -156 -125 -156 -125 -94 0 -31 0 94 94 156 125 156 219 406 375 437 250 406 437 375
234648 344 468 531 500 531 562 749 625 781 749 906 843 906 1124 999 1093 1031 1062 906 749 593 406 250 62 62
237683 -62 -125 -62 -62 -62 -62 -125 -62 -156 -156 -219 -187 -125 -187 -187 -250 -125 -156 -156 -250 -187 -94 -94 -281 -94 -94 -156 -187 -156 -156 -156 -187 -94 -125 -156
241873 -219 -250 -156 -219 -156 -125 -125 -156 -156 -250 -281 -187 -250 -156 -281 -187 -156 -156 -219 -187 -219 -62 -125 -125 -187 -187 -187 -250 -94 -156 -187 -187
245727 -219 -187 -156 -281 -187 -250 -187 -250 -312 -156 -187 -219 -62 -156 -250 -125 -219 -125 -312 -219 -156 -250 -250 -312 -281 -187 -250 -250 -219
249198 -187 -281 -312 -219 -125 -250 -219 -156 -187 -312 -219 -156 -156 -187 -187 -187 -156 -281 -156 -250 -312 -156 -125 -125 -219 -94 -187 -156 -94 -125
252812 -125 -125 -94 -187 -281 -156 -187 -94 -219 -156 -219 -187 -156 -250 -250 -187 -125 -219 -219 -187 -344 -187 -250 -156 -250 -187 -219 -219 -219 -125 -187
256523 -219 -219 -219 -250 -312 -219 -219 -187 -156 -312 -187 -312 -219 -281 -250 -187 -94 -94 -312 -250 -250 -156 -219 -187 -219 -281 -125 -156 -281 -156
260129 -125 -250 -156 -219 -62 -94 -125 -312 -125 -62 -250 -219 -219 -219 -344 -156 -250 -250 -250 -312 -312 -250 -281 -187 -250 -187 -219 -156 -219 -156
263768 -156 -250 -187 -187 -156 -156 -250 -156 -281 -156 -312 -250 -187 -250 -312 -375 -250 -219 -312 -312 -312 -219 -250 -156 -312 -219 -94 -187 -187 -156
267362 -187 -281 -219 -125 -219 -125 -187 -250 -187 -281 -250 -250 -250 -312 -344 -344 -281 -281 -187 -250 -219 -281 -219 -281 -219 -250 -250 -250 -312 -219 -156 -281 -125
271321 -219 -219 -281 -250 -187 -156 -344 -281 -187 -344 -250 -344 -250 -250 -219 -281 -250 -219 -156 -281 -187 -250 -187 -250 -187 -187 -281 -187 -219 -156 -250
275060 -187 -31 -187 -31 -31 0 31 94 187 187 250 312 312 344 500 562 687 656 468 312 156 31 -94 -94 -62 -156 -125 0
278398 94 312 375 468 687 812 874 937 1031 1124 1280 1468 1780 2124 2342 2623 2748 2717 2436 1936 1280 874 500 187
281301 0 0 -94 62 62 219 344 500 593 656 906 874 1031 1124 1280 1437 1624 1718 2124 2186 2373 2498 2124 1593 1249 812
284416 375 187 62 -31 -62 -156 -31 -62 -31 -31 125 156 250 156 250 250 375 312 406 437 531 593 625 687 625 593 312 156 -62
287912 -156 -187 -94 -250 -219 -219 -62 -156 -156 -187 -62 -31 62 0 -94 -31 62 0 -62 125 219 500 968 1405 1624 1874 1905
291157 2217 2342 2467 2467 2717 2935 3154 3623 3872 4372 4872 5090 5652 6121 6371 6090 5527 4591 3466 2124 1187
293694 593 156 -31 -62 -62 -62 -125 -219 -187 -187 -94 -62 -187 -94 -187 -156 -187 -62 31 -125 31 94 94 0 31 31 -62 0 125 94
297288 156 125 219 219 375 281 281 281 406 375 312 219 219 250 219 219 250 406 312 344 375 250 344 375 375 406 406 406 375 375 468 468 718 843
301348 874 874 968 874 906 687 812 749 656 718 749 812 781 812 562 593 718 718 843 812 937 687 718 593 718 718 968 1093
304733 1093 1218 1374 1468 1405 1405 1499 1686 1842 1999 2092 2186 2217 2342 2436 2561 2967 3466 4060 4840 5965 8650 14084
307521 22203 31541 41003 50215 58991 66892 73762 80819 87315 93248 100743 110580 123384 138436 153145 165480
309434 177347 180720 163950 131222 96933 68640 47280 32727 25170 23390 27294 39816 61520 87752
311124 114609 140809 166136 188277 207732 227437 245769 261633 280713 307320 341609 383799 426988
312672 462651 499375 520611 484760 394323 291612 202954 133127 83099 54150 40847 37474 44095
314242 60989 84442 109394 134127 158141 179939 198332 216289 234058 249360 265942 289301 320124
315790 358566 400943 436481 470645 498439 480513 403410 303198 212323 139529 85316 51277 34102
317335 26201 23952 26388 32009 39036 46281 53245 60146 65736 70858 76073 80913 85816 92468 101649 113203
319266 126444 138530 148773 157735 156580 137187 105771 75198 50028 31072 18113 11211 7713 5777
320974 4778 3997 3498 3029 2654 2342 1999 1686 1312 1031 812 687 718 781 749 906 906 937 843 812 593 531 468 437
323831 406 531 468 500 656 625 500 500 468 406 156 156 187 156 -62 -31 62 31 62 156 62 250 250 62 62 0 125 187 94
327325 219 187 94 281 125 125 125 187 156 187 187 312 219 344 500 344 468 437 437 562 437 500 531 687 781 749 749 843
330710 874 874 843 874 843 874 937 1062 1155 1280 1312 1312 1468 1468 1530 1593 1624 1718 1718 1967 1874 2030 1967 2217 2311 2405 2592 2623 2592
334189 2467 2311 2124 1936 1905 1936 1905 1967 2092 2280 2280 2248 2405 2405 2561 2623 2654 2748 2811 2935 3029 3185 3279 3498 3591 3623
337317 3747 3685 3498 3310 3341 3217 3185 3185 3373 3404 3373 3529 3529 3529 3591 3529 3529 3654 3716 3935 4216 4559 4997 5371 5684 6121
340445 6527 6714 7151 7651 8088 8588 9056 9775 10493 11336 12085 12866 13772 14552 15489 16551 17956 19518 21485 23827
342834 26700 30448 34726 40254 47061 56211 67672 81756 98557 116701 135438 153863 171288 187871
344502 204047 219537 234714 250390 266941 285179 304884 326526 349416 372994 396415 418119 435544
346097 444663 441478 422584 385797 334551 277278 222004 173787 135220 106239 85160 69640 58304
347665 49653 43095 37787 33696 30198 27231 24920 22297 19861 17769 16145 14490 13303 12429 11679 10930 10368
349711 9837 9462 9025 8525 8119 7745 7370 6995 6652 6558 6371 6121 5902 5871 5715 5684 5527 5309 5121 4653 4372 3966
352333 3685 3466 3279 3123 2873 2842 2686 2530 2498 2311 2342 2280 2186 2030 1999 1874 1718 1686 1655 1624 1499 1374 1437 1405
355238 1343 1280 1124 1187 1155 1062 1124 1093 937 1062 1062 1031 1062 843 937 874 749 812 749 687 625 656 562 500 531 468 406 500
358576 437 344 312 375 344 281 250 250 250 219 219 219 156 187 94 94 94 250 156 125 62 125 187 62 156 156 312 281 281 281 250 281 344 312
362685 281 281 250 250 312 250 281 250 219 187 250 406 312 94 250 281 219 344 281 375 344 250 281 344 406 406 375 406 375 468
366281 500 375 375 312 281 312 281 312 156 187 156 125 156 125 0 0 187 31 62 62 62 62 31 0 -31 31 -62 -94 0 -31 -31
369990 -125 -94 62 -94 -62 -94 -94 -156 -94 -125 -62 -187 -125 -156 -156 -94 -31 -125 -219 -219 -156 -156 0 -94 -94 -62 -31 -94 -62 -62 -31 31
373842 -94 31 -62 62 0 31 31 -31 62 31 62 62 0 31 94 -31 62 -62 31 62 -31 -31 31 31 0 31 -31 31 -31 -31 -31 -125
377719 -62 -62 -94 62 -62 0 -94 62 31 -94 -187 0 -62 -125 -94 -62 -62 -62 -156 -62 -187 -62 -62 -94 -94 -156 -62 -125 -62 -125
381307 -62 -62 -62 0 -62 0 -31 -62 -31 -62 -125 -125 -62 -219 -250 -62 -125 -31 -187 -156 -94 -219 -219 -187 -156 -219 -125 -187 -156 -187 -125
385016 -219 -312 -125 -250 -156 -156 -219 -281 -187 -125 -187 -187 -219 -94 -156 -156 -156 -125 -219 -250 -281 -187 -219 -187 -187 -219 -125 -125 -219 -219 -219 -219 -156 -187
389113 -281 -156 -156 -312 -312 -281 -281 -219 -187 -187 -250 -187 -219 -219 -250 -344 -250 -219 -375 -156 -281 -281 -281 -156 -156 -219 -219 -344 -250 -187 -219 -312
392970 -187 -250 -156 -250 -344 -250 -281 -187 -281 -219 -187 -156 -187 -312 -312 -250 -219 -219 -312 -187 -156 -125 -312 -281 -281 -250 -281 -219 -187 -187 -219
396704 -156 -187 -250 -281 -250 -187 -250 -219 -281 -250 -250 -219 -250 -281 -250 -281 -312 -250 -250 -312 -219 -219 -250 -250 -187 -219 -281 -250 -250 -156 -281 -156 -187
400653 -187 -219 -187 -219 -219 -219 -187 -281 -219 -187 -187 -187 -156 -187 -125 -156 -250 -219 -187 -156 -187 -250 -187 -31 -250 -187 -187 -156 -312 -219 -156 -281
404507 -187 -62 -219 -156 -219 -250 -281 -187 -156 -250 -187 -187 -156 -219 -219 -187 -125 -219 -156 -156 -156 -187 -156 -219 -219 -250 -250 -187 -281 -281 -125 -250 -219
408456 -281 -250 -156 -281 -187 -219 -250 -125 -219 -219 -187 -187 -219 -281 -156 -219 -250 -312 -187 -281 -250 -250 -250 -94 -187 -250 -281 -156 -156 -219
412070 -219 -94 -219 -219 -125 -125 -125 -219 -187 -125 -312 -219 -219 -219 -219 -250 -219 -187 -125 -250 -250 -250 -250 -250 -156 -187 -187 -250 -281 -344 -187 -156 -281 -156
416167 -219 -250 -156 -125 -187 -312 -250 -250 -250 -250 -281 -281 -312 -344 -219 -250 -281 -219 -312 -281 -312 -156 -156 -281 -250 -281 -187 -344 -312 -281 -219
419904 -250 -250 -312 -156 -250 -219 -250 -312 -250 -219 -250 -281 -250 -250 -187 -219 -156 -312 -219 -281 -187 -281 -375 -187 -250 -250 -187 -219 -187 -250 -156
423617 -187 -281 -156 -281 -187 -344 -281 -344 -312 -281 -219 -281 -219 -312 -312 -219 -344 -281 -250 -312 -156 -281 -219 -250 -281 -187 -219 -250
426993 -187 -219 -219 -219 -187 -219 -312 -250 -344 -281 -281 -312 -312 -250 -281 -250 -281 -281 -250 -375 -312 -281 -250 -219 -250 -219 -281 -281 -281 -219 -281 -187 -250 -375
431065 -281 -250 -312 -187 -187 -187 -250 -312 -219 -187 -281 -281 -437 -281 -375 -312 -250 -281 -250 -219 -250 -187 -375 -187 -375 -219 -250 -312 -344
434564 -312 -344 -344 -344 -281 -125 -219 -187 -219 -156 -250 -156 -250 -250 -156 -187 -250 -312 -281 -312 -312 -344 -312 -219 -281 -219 -344 -312 -219 -312 -437 -281
438403 -219 -344 -312 -281 -281 -437 -312 -312 -312 -344 -250 -312 -344 -281 -281 -250 -281 -187 -375 -187 -312 -375 -250 -219 -281 -344 -156 -219 -219
441899 -250 -187 -312 -281 -344 -250 -281 -281 -312 -312 -219 -156 -250 -156 -312 -250 -250 -375 -187 -344 -187 -375 -219 -187 -187 -219 -250 -281 -281
445395 -344 -187 -250 -250 -281 -281 -281 -344 -219 -250 -281 -219 -281 -281 -219 -281 -250 -250 -312 -187 -312 -406 -344 -250 -187 -156 -281 -250 -219 -344 -219
449086 -344 -312 -219 -250 -250 -344 -250 -281 -281 -375 -312 -281 -250 -312 -281 -344 -219 -281 -250 -375 -281 -281 -219 -219 -312 -250 -344 -344 -312 -312 -312 -281 -219
453088 -312 -187 -281 -281 -156 -281 -250 -219 -219 -187 -250 -312 -219 -312 -250 -344 -187 -437 -406 -281 -344 -281 -250 -312 -250 -219 -250 -281 -312
456539 -375 -344 -281 -219 -281 -312 -219 -312 -312 -344 -219 -344 -344 -375 -344 -187 -312 -281 -344 -312 -344 -312 -344 -281 -375 -375 -281 -281 -250 -312 -375
460273 -250 -281 -250 -250 -250 -312 -312 -250 -250 -250 -312 -344 -281 -312 -312 -344 -281 -344 -375 -281 -281 -281 -406 -312 -250 -344 -281 -281 -312 -312 -250 -281 -375 -344 -281
464470 -344 -312 -312 -281 -281 -344 -281 -344 -250 -250 -281 -250 -406 -344 -281 -281 -250 -281 -344 -344 -344 -344 -344 -250 -219 -219 -281 -281 -250 -375 -250 -312 -219 -250
468570 -281 -250 -187 -312 -281 -250 -281 -281 -250 -375 -375 -281 -500 -375 -312 -312 -312 -312 -344 -375 -344 -312 -312 -344 -281 -312 -344 -312 -312 -344 -375 -281
472411 -312 -312 -375 -281 -219 -281 -250 -250 -250 -312 -281 -375 -344 -406 -344 -375 -250 -344 -281 -312 -344 -219 -312 -406 -250 -219 -187 -250 -312 -375 -312
476168 -437 -250 -312 -344 -281 -281 -375 -281 -250 -437 -250 -344 -312 -312 -250 -344 -312 -219 -219 -250 -281 -312 -250 -250 -250 -281 -312 -250 -281 -250 -281 -344
479982 -250 -344 -281 -375 -312 -406 -375 -437 -281 -312 -344 -281 -219 -281 -375 -250 -250 -312 -406 -250 -312 -250 -281 -312 -312 -281 -281 -344 -344 -250 -312
483701 -312 -281 -344 -344 -281 -375 -281 -344 -344 -312 -406 -344 -281 -344 -344 -375 -281 -375 -281 -344 -281 -375 -281 -344 -406 -312 -312 -312 -375 -281 -281 -219 -281 -344
487805 -375 -375 -312 -281 -344 -344 -344 -250 -406 -187 -312 -312 -312 -219 -250 -250 -312 -312 -312 -281 -344 -281 -250 -281 -219 -375 -281 -344 -281 -187 -250 -344 -250
491754 -187 -281 -219 -187 -219 -312 -375 -344 -437 -344 -219 -375 -375 -375 -250 -281 -312 -312 -250 -344 -312 -219 -312 -375 -281 -250 -281 -344 -312 -312 -187
495496 -187 -219 -312 -281 -312 -312 -250 -375 -312 -187 -250 -281 -250 -344 -312 -375 -281 -250 -375 -375 -344 -281 -312 -219 -187 -250 -219 -312 -219 -250
499117 -250 -344 -156 -375 -312 -344 -312 -281 -312 -250 -312 -375 -312 -375 -281 -250 -250 -250 -219 -187 -281 -250 -344 -250 -281 -281 -312 -281 -281 -312 -312 -344
502954 -219 -375 -250 -312 -219 -375 -312 -344 -344 -281 -219 -250 -281 -219 -375 -344 -250 -375 -344 -219 -344 -281 -156 -281 -281 -250 -375
506189 -219 -219 -312 -281 -156 -281 -312 -312 -250 -344 -375 -375 -250 -281 -312 -312 -281 -375 -250 -312 -281 -344 -344 -281 -312 -312 -312 -281 -312 -375 -312 -312
510043 -250 -219 -219 -250 -281 -281 -219 -312 -344 -250 -219 -281 -312 -281 -250 -312 -312 -250 -344 -312 -281 -187 -219 -312 -281 -312 -312 -312 -344 -344 -312 -312 -281 -250
514145 -219 -281 -375 -219 -312 -312 -250 -219 -281 -156 -187 -250 -312 -344 -312 -281 -344 -344 -281 -375 -250 -250 -312 -250 -312 -312 -219 -219 -281 -250 -219 -250
517982 -281 -406 -312 -344 -281 -375 -156 -406 -344 -312 -250 -187 -312 -281 -344 -281 -312 -281 -312 -312 -219 -281 -406 -312 -219 -281 -187 -156 -344
521483 -281 -312 -375 -187 -250 -344 -344 -281 -344 -219 -250 -281 -250 -344 -344 -281 -250 -312 -281 -219 -281 -219 -250 -281 -281 -156 -219 -375 -250 -281
525054 -281 -219 -312 -250 -281 -312 -250 -375 -344 -312 -250 -437 -281 -250 -219 -281 -344 -250 -250 -250 -281 -281 -312 -250 -312 -281 -219 -312 -156 -281
528695 -219 -312 -187 -250 -219 -250 -281 -281 -312 -312 -187 -250 -250 -312 -250 -281 -344 -375 -250 -312 -312 -219 -375 -312 -344 -156 -187 -312 -281 -281
532269 -250 -281 -312 -281 -344 -281 -250 -219 -219 -312 -375 -281 -281 -250 -281 -312 -312 -281 -250 -219 -219 -312 -281 -312 -312 -219 -281 -250 -344 -281 -250 -312 -250
536261 -156 -281 -281 -375 -375 -281 -250 -250 -344 -437 -219 -219 -312 -250 -344 -156 -281 -344 -281 -344 -281 -312 -250 -219 -281 -219 -250 -281 -156 -219
539855 -250 -187 -187 -312 -344 -250 -250 -312 -187 -219 -187 -344 -187 -250 -250 -250 -219 -250 -344 -375 -281 -250 -281 -156 -187 -344 -219 -312 -344
543353 -250 -250 -281 -312 -219 -281 -219 -312 -312 -312 -375 -312 -281 -312 -281 -250 -312 -187 -250 -250 -281 -281 -281 -281 -250 -375 -344 -375 -250 -250 -187 -344 -219
547310 -344 -250 -281 -375 -281 -281 -344 -375 -187 -312 -312 -250 -250 -219 -281 -219 -219 -281 -281 -250 -281 -250 -312 -312 -219 -219 -250 -250 -187 -219 -219 -312 -281 -250
551432 -250 -281 -219 -219 -219 -219 -312 -281 -281 -406 -312 -187 -250 -156 -250 -219 -281 -312 -156 -219 -250 -281 -281 -250 -219 -219 -187 -187 -250 -437 -250 -312
555266 -344 -344 -250 -250 -281 -156 -281 -312 -312 -187 -156 -281 -344 -281 -281 -344 -312 -219 -250 -250 -250 -344 -250 -281 -187 -219 -281 -281 -281 -219 -312 -250 -250
559220 -219 -312 -281 -219 -187 -250 -250 -312 -250 -219 -250 -281 -281 -250 -250 -156 -250 -281 -250 -281 -312 -187 -219 -312 -250 -312 -375 -312 -312 -250 -156 -312
563055 -250 -250 -219 -219 -344 -250 -281 -250 -187 -250 -344 -312 -250 -281 -187 -156 -250 -250 -187 -219 -250 -125 -219 -344 -156 -281 -250 -250 -250 -281 -281
566813 -312 -250 -156 -281 -312 -281 -156 -312 -375 -250 -250 -187 -312 -312 -281 -219 -187 -219 -281 -312 -281 -219 -281 -312 -250 -219 -187 -250 -312
570287 -250 -281 -250 -219 -250 -187 -344 -250 -250 -250 -219 -219 -344 -250 -250 -312 -250 -187 -312 -281 -219 -125 -219 -250 -281 -187 -281 -156 -187 -219 -219
574023 -250 -250 -187 -250 -281 -125 -219 -250 -281 -250 -94 -156 -156 -187 -219 -187 -344 -250 -187 -219 -219 -187 -375 -187 -219 -312 -250 -219 -281 -281
577637 -156 -219 -281 -219 -187 -219 -250 -250 -281 -219 -219 -219 -250 -219 -250 -250 -250 -219 -219 -344 -187 -125 -250 -250 -250 -312 -125 -156 -250 -219 -187 -250 -219
581589 -219 -219 -187 -281 -187 -281 -219 -281 -187 -281 -312 -250 -187 -219 -156 -219 -250 -281 -187 -250 -312 -281 -187 -250 -250 -125 -250 -281 -344 -250 -281
585325 -312 -250 -281 -187 -156 -187 -312 -250 -219 -125 -187 -187 -250 -312 -125 -250 -250 -187 -156 -187 -219 -375 0 31 -250 -156 -250 -187 -125
588796 -62 -219 -187 -156 -250 -187 -250 -187 -187 -187 -187 -156 -250 -187 -250 -187 -187 -344 -250 -187 -156 -156 -156 -250 -219 -125 -312 -344 -187 -344 -125 -156
592653 -281 -156 -156 -281 -219 -312 -250 -156 -219 -187 -187 -250 -156 -250 -187 -219 -312 -125 -125 -125 -187 -94 -281 -219 -219 -219 -250 -156 -125 -156 -219 -219
596484 -250 -281 -219 -187 -250 -250 -250 -281 -250 -156 -281 -219 -156 -219 -219 -94 -62 -375 -219 -62 -250 -187 -250 -94 -156 -187 -187 -125 -250
599978 -187 -187 -281 -125 -250 -281 -219 -219 -281 -281 -312 -156 -219 -187 -156 -250 -187 -187 -125 -250 -219 -250 -187 -219 -281 -219 -187 -219 -125 -62 -125
603687 0 31 31 31 94 187 312 344 375 437 468 531 718 781 999 1062 1249 1405 1530 1468 1655 1593 1499 1593 1499 1499 1499 1405 1343 1405
607333 1374 1343 1218 1249 1155 1093 999 937 718 718 749 656 687 812 874 874 968 1124 1280 1405 1405 1561 1655 1718 1811 1780 1718 1780
610671 1811 1561 1530 1405 1374 1218 968 999 874 656 500 406 187 94 -94 -156 -156 -219 -187 -156 -187 -187 -125 -156 -156 -187 -156
613924 -31 -94 -219 -156 -31 -31 -62 -62 -62 62 62 94 125 125 94 219 219 281 312 250 406 468 375 406 500 500 375 437 406 219 312
617646 375 281 312 219 344 375 437 468 437 593 687 593 718 718 749 812 874 843 906 906 906 906 906 812 562 593 593 375 250 219 219
621390 94 156 62 187 156 156 125 250 156 219 250 250 219 312 312 281 312 312 281 219 125 187 187 94 94 -62 -125 -94 -31 -125 -31 -156 -125
625367 -312 -187 -281 -281 -250 -250 -281 -219 -344 -187 -312 -125 -187 -219 -187 -94 -125 -94 -187 -125 -125 -31 31 31 156 125 94 156 62 250
628958 187 250 250 281 187 187 312 219 187 312 219 312 250 281 281 219 219 312 344 281 375 375 468 468 500 625 656 593 687 749 656 687
632792 749 718 593 656 718 781 718 843 812 812 812 812 874 906 874 906 906 874 968 874 874 874 937 937 937 937 999 906 906 874 843 781 781 749 812
637019 593 749 625 781 749 906 781 812 874 1155 1062 1312 1312 1280 1312 1561 1655 1780 1842 2030 2280 2561 2811 3185 3747
640022 4372 5434 6714 8057 9431 10711 12179 14084 17113 21766 28980 38349 49841 64081 80070 95434
641957 111861 129879 146774 159765 172694 188339 204922 219256 232840 248642 266660 283024 302261
643483 327962 352851 368465 382862 399444 398851 379708 359034 341984 312317 271313 236088 212573 192337
645173 174973 166323 163544 161452 162420 169134 178221 190213 207482 225720 239242 252795 270814 291518 310505
647009 327993 346605 364437 378334 393854 416401 434483 434420 425770 418369 391856 346887 303229 269127
648677 231435 183249 138311 104366 78914 60240 48404 40378 32415 24171 17457 12741 9275 7183
650339 6277 5527 5090 4840 5215 5996 6995 9306 11461 12648 14334 18144 22516 24233 24233 26138 29511 32228 32759
652628 33477 34882 37006 38973 40909 43345 46218 47811 50122 54494 61145 65455 66204 70108 78259 88064
654589 93967 97121 97964 101212 104616 111174 109831 101399 94560 91812 91406 88908 86503 83942 83942 86503 90688
656593 95153 100212 104459 110330 117107 126694 136968 143620 148242 156455 169946 186684 191962 189963 192399
658403 187808 185123 187059 169540 141621 121635 104178 92624 84348 71826 63238 59178 58085 58678
660094 60302 63175 66517 68016 71107 76416 84442 88346 88127 92093 101180 109550 111861 110330 105084 102336
662025 99244 95684 80726 64331 51933 42783 33789 23172 15708 10212 6870 5340 4591 3966 3591 3185
663950 3217 2811 2498 2155 1905 1780 1655 1624 1624 1499 1655 1655 1686 1749 1749 1718 1780 1749 1686 1811 1561 1530 1686 1499 1405 1280
667048 1031 968 843 718 593 437 406 344 468 312 250 312 406 281 312 219 125 156 94 94 -62 0 -62 -94 -94 -219 -125
670306 -156 -281 -406 -344 -437 -406 -437 -500 -562 -500 -531 -437 -500 -375 -500 -437 -406 -500 -344 -468 -437 -437 -531 -468 -468 -531 -562 -437 -562
673805 -468 -312 -468 -468 -375 -437 -375 -312 -281 -344 -406 -281 -219 -281 -281 -281 -187 -344 -219 -250 -250 -219 -250 -156 -187 -219 -156 -187 -62 -62
677401 31 -62 -62 62 62 125 312 312 344 437 437 500 562 625 593 781 874 906 999 1062 1218 1249 1312 1405 1468 1561 1593 1468 1437 1374 1280
681147 1155 1124 1031 999 968 906 999 937 874 843 843 843 812 937 999 1187 1155 1312 1468 1561 1811 2030 2155 2217 2248 2405 2405
684365 2373 2092 1999 1967 1874 1655 1624 1561 1530 1499 1405 1312 1031 999 843 593 468 437 250 312 187 187 156 312 344 281
687506 281 281 344 406 375 437 531 562 656 749 625 843 781 843 781 1031 1031 1124 1124 1187 1187 1312 1468 1499 1593 1811 1686 1811 1811
690992 2030 1967 2248 2248 4840 8838 14552 21704 29511 31478 30354 28855 29355 29355 20954 16270 12366 10680 8494
693301 5996 4747 3623 2935 2623 2654 2717 2623 2561 2530 2405 2561 2561 2842 2998 3373 3810 4559 5246 6464 8088 9306
695948 9775 10930 13054 16738 21485 27981 38317 50903 57398 59241 63987 72325 79258 83942 88876 95715
697831 99650 102773 107957 116607 124446 131004 139467 151084 159765 163325 167760 184404 203485 210980 214446
699642 226875 240553 253794 258853 241709 221972 205827 185310 173412 177097 186559 188089 177971 174505
701339 176098 178471 182218 189963 201112 212698 222410 235775 249953 264100 277028 295078 318843 333646
703007 338424 351477 367653 383080 376647 344451 316095 294766 274686 251983 213791 181438 159172
704578 132097 111829 104366 101087 99525 99525 99151 99119 98557 101430 108738 117294 121042 125476 134033 142059 145806
706629 145619 147742 154581 153551 150116 145525 140185 138061 127131 99681 71451 49841 32946 23359 19799
708437 18113 17675 15302 11430 8713 6433 4716 3935 3435 3029 2623 2280 1811 1686 1530 1312 1093 1031 718
710718 843 687 656 437 531 312 344 250 344 344 250 281 281 187 125 156 187 94 125 0 -94 31 0 0 -94 -156 -219 -281 -281 -375
714337 -531 -593 -593 -593 -562 -500 -531 -531 -656 -625 -593 -687 -562 -593 -625 -500 -562 -500 -687 -531 -531 -625 -593 -531 -500 -500 -500 -406 -500 -406 -531
718028 -406 -406 -375 -187 -406 -406 -375 -344 -312 -187 -344 -281 -219 -281 -250 -281 -219 -156 -219 -312 -281 -344 -375 -187 -312 -312 -344 -281 -219
721524 -156 -125 -250 -125 -312 -187 -312 -281 -250 -156 -31 -125 -125 -94 -125 -156 -187 -94 -62 -31 -156 -187 -187 -125 -187 -187 -250 -250 -375
725028 -312 -375 -312 -375 -281 -344 -375 -344 -281 -344 -375 -344 -344 -375 -219 -375 -312 -219 -312 -250 -219 -219 -312 -281 -281 -250 -250 -219 -219 -187 -187 -156 -156
729002 -156 -94 -156 -156 -31 0 31 31 0 62 125 62 219 156 94 156 0 -94 -94 -156 -125 -156 -187 -125 -187 -125 -156 -219 -187 -219 -125
732713 -94 -94 -156 0 -31 156 0 156 125 250 250 156 344 250 312 375 219 219 312 281 437 281 437 344 500 468 531
735954 625 718 749 749 718 843 999 937 1031 874 812 781 812 843 843 687 718 593 718 687 781 718 812 749 843 937 968 968 1249
739460 1218 1343 1312 1374 1499 1624 1624 1686 1468 1405 1437 1405 1312 1155 968 812 781 687 749 749 625 593 406 468 344 281
742580 281 281 281 406 406 312 312 406 562 593 500 344 437 468 468 406 406 156 94 62 187 156 -31 -156 -125 -219 -250 -344 -187 -281
746174 -344 -375 -375 -468 -375 -375 -312 -406 -312 -406 -406 -406 -468 -375 -344 -375 -344 -406 -406 -344 -437 -344 -437 -500 -468 -375 -375 -344 -500 -468 -468 -437 -375 -437
750281 -500 -500 -468 -562 -375 -500 -468 -468 -375 -531 -468 -562 -468 -468 -500 -468 -437 -500 -375 -406 -437 -500 -344 -468 -468 -437 -531 -500 -437 -437
753860 -406 -437 -468 -437 -437 -468 -531 -437 -437 -593 -437 -468 -437 -468 -437 -500 -531 -437 -562 -468 -531 -437 -500 -406 -437 -437 -531 -437 -500 -437 -531
757626 -500 -500 -406 -375 -312 -500 -500 -344 -500 -500 -406 -531 -500 -437 -468 -500 -406 -500 -437 -500 -437 -500 -500 -344 -344 -500 -406 -500 -531 -500
761205 -468 -406 -468 -531 -531 -406 -531 -468 -468 -468 -500 -531 -437 -406 -406 -437 -437 -531 -562 -468 -531 -531 -375 -468 -406 -500 -562 -531 -437 -375 -344 -437
765044 -468 -437 -437 -468 -468 -437 -500 -562 -468 -437 -562 -500 -437 -468 -437 -500 -468 -531 -375 -500 -500 -406 -500 -437 -562 -531 -468 -437 -468 -500
768670 -500 -468 -406 -500 -500 -593 -468 -406 -437 -500 -468 -500 -500 -531 -500 -437 -437 -437 -468 -468 -562 -437 -500 -531 -468 -468 -406 -406 -468 -437 -406 -375 -375
772622 -344 -375 -250 -406 -406 -344 -250 -344 -281 -375 -250 -375 -344 -219 -312 -250 -219 -250 -250 -250 -219 -250 -219 -62 -94 -125 -62 -94 -125
776118 -156 -187 -125 -219 -94 -156 -219 -219 -250 -187 -281 -344 -344 -219 -312 -250 -344 -281 -187 -312 -219 -187 -250 -250 -187 -250 -250 -250 -281 -375 -281 -437
779985 -344 -312 -312 -344 -406 -344 -437 -531 -468 -500 -531 -468 -531 -437 -468 -437 -468 -344 -531 -437 -437 -437 -500 -593 -437 -531 -344 -531 -437 -437
783563 -468 -437 -437 -437 -468 -468 -531 -437 -437 -437 -468 -500 -406 -531 -344 -468 -406 -406 -500 -468 -344 -468 -531 -375 -468 -468 -437 -406 -437 -468 -437
787310 -437 -437 -562 -437 -437 -468 -531 -406 -375 -406 -531 -531 -437 -406 -437 -375 -500 -562 -406 -468 -437 -437 -593 -468 -375 -468 -531 -500 -437
790788 -531 -406 -562 -500 -406 -500 -437 -468 -500 -500 -437 -437 -500 -375 -468 -312 -406 -406 -593 -406 -468 -437 -468 -406 -468 -500 -531 -344 -375
794294 -500 -437 -406 -406 -437 -406 -500 -344 -500 -375 -593 -468 -406 -562 -500 -375 -437 -468 -468 -500 -437 -468 -375 -375 -468 -531 -468 -468 -375
797753 -468 -531 -437 -406 -375 -406 -437 -437 -468 -437 -437 -406 -468 -468 -375 -406 -344 -406 -406 -500 -406 -375 -437 -375 -500 -437 -531 -500 -468 -468 -406 -531 -406
801712 -468 -437 -468 -468 -437 -437 -437 -406 -468 -406 -500 -406 -500 -531 -406 -468 -375 -468 -531 -406 -468 -468 -500 -468 -468 -468 -406 -468 -437 -468 -500 -437 -437
805699 -375 -468 -531 -468 -437 -437 -437 -500 -406 -375 -437 -531 -437 -406 -406 -437 -500 -406 -437 -406 -468 -468 -406 -468 -500 -437 -437 -406 -375 -468 -562 -437 -593
809658 -375 -437 -437 -531 -468 -375 -375 -437 -437 -468 -562 -406 -437 -500 -562 -468 -406 -437 -406 -500 -437 -437 -468 -437 -437 -437 -468 -344 -468 -406 -437 -437
813525 -375 -437 -468 -468 -406 -344 -375 -468 -375 -468 -531 -531 -468 -531 -468 -500 -406 -531 -468 -437 -406 -468 -468 -468 -468 -500 -437 -406 -468 -437 -468 -406 -406
817484 -437 -437 -406 -406 -500 -562 -344 -437 -437 -468 -437 -406 -437 -468 -531 -531 -468 -593 -406 -531 -468 -531 -500 -593 -531 -468 -468 -531 -531 -468 -468 -375
821351 -562 -562 -531 -468 -531 -562 -500 -406 -500 -500 -562 -531 -500 -437 -406 -437 -437 -468 -406 -437 -406 -344 -437 -437 -500 -531 -468 -531 -531 -468 -531 -406 -531
825310 -468 -468 -468 -531 -500 -531 -406 -531 -656 -375 -437 -250 -468 -406 -406 -375 -406 -468 -562 -437 -468 -531 -531 -500 -468 -437 -531 -500 -468
828768 -437 -437 -375 -468 -500 -500 -531 -468 -406 -344 -375 -406 -500 -437 -406 -468 -500 -437 -562 -468 -468 -593 -406 -406 -468 -531 -468 -562 -531 -468 -500
832535 -562 -437 -593 -500 -437 -531 -500 -531 -531 -500 -468 -593 -500 -562 -437 -437 -468 -500 -468 -468 -437 -500 -312 -500 -468 -500 -406 -468 -531
835993 -500 -531 -437 -500 -562 -468 -500 -500 -468 -437 -468 -468 -406 -500 -437 -437 -468 -500 -500 -437 -468 -375 -468 -531 -500 -468 -531 -531 -500 -406 -500 -500 -468 -406
840100 -500 -468 -500 -468 -344 -468 -531 -437 -437 -437 -406 -468 -531 -562 -437 -562 -468 -593 -500 -437 -500 -406 -437 -562 -531 -437 -468 -437 -375
843579 -500 -468 -500 -468 -375 -500 -562 -500 -468 -562 -500 -437 -531 -531 -468 -437 -437 -593 -468 -531 -468 -468 -468 -531 -500 -406 -531 -468 -406 -500 -500
847278 -437 -500 -406 -562 -375 -437 -437 -562 -437 -468 -531 -531 -531 -468 -531 -562 -500 -500 -437 -531 -531 -468 -468 -468 -344 -468 -468 -437 -562 -468 -344
851044 -562 -406 -437 -500 -500 -593 -500 -531 -531 -500 -468 -468 -593 -625 -593 -500 -531 -468 -625 -562 -531 -437 -562 -531 -437 -531 -562 -593 -468 -625
854623 -406 -437 -468 -500 -468 -500 -531 -593 -406 -500 -531 -468 -406 -406 -437 -375 -312 -437 -468 -500 -406 -562 -500 -406 -531 -468 -593 -531 -468
858129 -562 -500 -625 -468 -468 -437 -593 -531 -375 -500 -437 -468 -406 -500 -562 -437 -437 -437 -375 -375 -500 -406 -375 -437 -531 -500 -437 -531 -531
861607 -468 -406 -406 -531 -437 -406 -468 -531 -468 -437 -468 -375 -593 -500 -468 -406 -406 -468 -562 -562 -562 -562 -468 -500 -468 -468 -406 -562 -406 -468 -375 -437
865474 -531 -375 -437 -500 -437 -531 -468 -468 -500 -468 -562 -468 -500 -406 -406 -437 -468 -468 -468 -562 -375 -531 -531 -375 -468 -406 -437 -437 -500 -468 -562 -531
869293 -437 -468 -406 -468 -531 -437 -375 -468 -531 -468 -437 -375 -406 -406 -312 -468 -406 -531 -531 -406 -500 -531 -531 -468 -437 -531 -562 -531 -531 -531 -531 -437
873132 -468 -375 -531 -468 -531 -468 -468 -468 -437 -468 -500 -406 -468 -468 -468 -500 -562 -375 -500 -406 -437 -500 -531 -593 -468 -468 -406 -468 -406 -500 -500
876879 -437 -437 -531 -531 -437 -468 -375 -500 -437 -531 -531 -437 -406 -468 -468 -375 -468 -375 -406 -468 -344 -500 -562 -531 -625 -468 -531 -406 -562 -468
880477 -531 -500 -500 -468 -500 -468 -406 -437 -562 -500 -531 -500 -375 -437 -531 -500 -437 -437 -500 -437 -531 -500 -468 -500 -437 -468 -437 -625 -562 -531
884103 -437 -625 -562 -344 -406 -468 -437 -375 -500 -468 -468 -468 -406 -500 -437 -500 -437 -437 -562 -406 -437 -437 -468 -406 -468 -437 -406 -406 -375 -375 -468
887802 -500 -562 -468 -468 -468 -437 -468 -437 -500 -437 -500 -437 -406 -500 -562 -468 -468 -468 -437 -437 -437 -375 -406 -500 -406 -500 -406 -500 -531 -468 -562 -437 -500
891809 -500 -437 -437 -375 -344 -468 -437 -500 -500 -437 -468 -437 -468 -468 -500 -500 -437 -468 -531 -468 -437 -375 -468 -437 -344 -500 -375 -500 -468 -406 -375
895508 -500 -468 -375 -375 -531 -437 -375 -375 -468 -500 -406 -468 -344 -437 -406 -468 -468 -344 -437 -437 -500 -437 -406 -562 -468 -531 -406 -531 -531 -437
899107 -406 -468 -468 -437 -437 -531 -437 -437 -531 -406 -437 -406 -500 -500 -406 -531 -375 -500 -468 -437 -500 -468 -562 -312 -468 -375 -406 -437 -406 -406
902733 -406 -468 -437 -500 -437 -406 -437 -531 -406 -468 -468 -468 -500 -375 -468 -437 -437 -437 -468 -375 -406 -406 -406 -375 -468 -468 -312 -406 -562 -531 -531 -500 -468
906692 -437 -375 -406 -344 -344 -468 -437 -500 -375 -375 -531 -344 -406 -437 -437 -593 -468 -468 -437 -531 -531 -562 -437 -437 -406 -312 -468 -375 -406 -437
910318 -375 -437 -468 -531 -468 -593 -500 -468 -437 -500 -562 -531 -468 -312 -468 -406 -344 -468 -437 -406 -468 -437 -468 -406 -500 -500 -531 -406 -406
913777 -406 -531 -500 -468 -468 -437 -468 -437 -375 -344 -406 -468 -375 -406 -344 -468 -406 -437 -500 -437 -312 -406 -406 -437 -437 -437 -468 -437 -406 -468 -406
917496 -437 -468 -437 -468 -437 -437 -437 -531 -437 -468 -468 -344 -437 -593 -437 -437 -437 -468 -375 -375 -500 -375 -406 -531 -468 -437 -500 -437 -562 -375
921122 -375 -500 -437 -500 -437 -468 -406 -468 -437 -437 -468 -406 -468 -406 -468 -406 -344 -406 -406 -437 -406 -406 -375 -406 -437 -531 -531 -375 -437 -375 -437 -406
924989 -344 -375 -437 -437 -531 -468 -406 -562 -406 -406 -468 -375 -437 -312 -437 -437 -406 -468 -344 -500 -312 -468 -468 -468 -437 -437 -406 -500 -406 -437
928587 -406 -500 -500 -437 -375 -406 -500 -406 -500 -375 -562 -375 -437 -406 -468 -468 -500 -468 -406 -437 -375 -500 -468 -468 -437 -500 -437 -468 -437 -500
932166 -468 -406 -500 -468 -437 -406 -344 -406 -437 -437 -375 -375 -406 -344 -344 -406 -406 -406 -437 -375 -468 -468 -468 -468 -406 -406 -344 -406 -344 -375 -406 -375 -437 -375 -468
936413 -406 -468 -531 -375 -406 -468 -437 -500 -406 -437 -437 -406 -375 -406 -531 -468 -468 -437 -500 -468 -468 -406 -468 -375 -468 -375 -406 -468 -406 -406 -375 -437
940232 -437 -375 -406 -468 -375 -468 -500 -500 -562 -468 -406 -406 -500 -468 -406 -531 -468 -375 -406 -406 -468 -500 -500 -562 -468 -468 -468 -468 -406 -406 -437 -500 -375 -531
944312 -406 -406 -500 -437 -437 -375 -468 -468 -531 -437 -406 -375 -500 -500 -437 -437 -406 -437 -437 -437 -468 -437 -344 -468 -531 -406 -375 -468 -562 -593 -437 -468
948178 -468 -531 -406 -468 -468 -468 -406 -500 -406 -406 -468 -437 -437 -468 -406 -375 -531 -375 -468 -468 -468 -468 -437 -312 -375 -406 -375 -531 -437 -406 -468 -468
952017 -406 -344 -437 -437 -344 -375 -406 -500 -437 -468 -468 -468 -500 -500 -468 -437 -531 -468 -406 -468 -468 -406 -468 -500
954922d68  $$checkpoint
##END=
